BDBM50452345 CHEMBL2114053
SMILES [H][C@]12CCc3c(O)cccc3[C@@]1([H])CCCN2CCC
InChI Key InChIKey=ANYSYRVXKLTFPB-HIFRSBDPSA-N
Data  4 IC50
  Tab Delimited (TSV)   2D SDfile   Computed 3D by Vconf -m prep SDfile
Find this compound or compounds like it in BindingDB:
Activity Spreadsheet -- Enzyme Inhibition Constant Data from BindingDB
Found 4 hits for monomerid = 50452345
TargetSigma non-opioid intracellular receptor 1(RAT)
University Of G£Teborg
Curated by ChEMBL
LigandPNGBDBM50452345(CHEMBL2114053)
Affinity DataIC50:  48nM. Assay description: In vitro for binding affinity against sigma receptor using [3H](+)-3-PPP as radioligand
In DepthDetails ArticlePubMed
TargetSigma non-opioid intracellular receptor 1(RAT)
University Of G£Teborg
Curated by ChEMBL
LigandPNGBDBM50452345(CHEMBL2114053)
Affinity DataIC50:  48nM. Assay description: In vitro for binding affinity against sigma receptor using [3H](+)-3-PPP as radioligand
In DepthDetails ArticlePubMed
TargetD(2) dopamine receptor(Rattus norvegicus (rat))
University Of G£Teborg
Curated by ChEMBL
LigandPNGBDBM50452345(CHEMBL2114053)
Affinity DataIC50:  160nM. Assay description: In vitro for binding affinity against sigma receptor using [3H](+)-3-PPP as radioligand
In DepthDetails ArticlePubMed
TargetD(2) dopamine receptor(Rattus norvegicus (rat))
University Of G£Teborg
Curated by ChEMBL
LigandPNGBDBM50452345(CHEMBL2114053)
Affinity DataIC50:  160nM. Assay description: Binding affinity against Dopamine receptor D2 using [3H]spiperone as radioligand
In DepthDetails ArticlePubMed