BDBM50452522 CHEMBL4211655
SMILES CO[C@@]12C[C@H](N(C1)C(=O)[C@@H](NC(=O)OCCCCCOc1ccc3ccc2cc3c1)C(C)(C)C)C(=O)N[C@@]1(C[C@H]1C=C)C(=O)NS(=O)(=O)C1CC1
InChI Key InChIKey=QOAMSTDXGATQAD-QUUVPDOLSA-N
Data  2 EC50
  Tab Delimited (TSV)   2D SDfile   Computed 3D by Vconf -m prep SDfile
Find this compound or compounds like it in BindingDB:
Activity Spreadsheet -- Enzyme Inhibition Constant Data from BindingDB
Found 2 hits for monomerid = 50452522
TargetGenome polyprotein(Hepatitis C virus)
Bristol-Myers Squibb
Curated by ChEMBL
LigandPNGBDBM50452522(CHEMBL4211655)
Affinity DataEC50:  13nM. Assay description: Inhibition of HCV genotype 1a H77 NS3 protease infected in human HuH7 replicon cells assessed as reduction in viral replication after 4 days by lucif...
Ligand InfoPC cidPC sid
In DepthDetails ArticlePubMed
TargetGenome polyprotein(Hepatitis C virus)
Bristol-Myers Squibb
Curated by ChEMBL
LigandPNGBDBM50452522(CHEMBL4211655)
Affinity DataEC50:  7nM. Assay description: Inhibition of HCV genotype 1b Con1 NS3 protease infected in human HuH7 replicon cells assessed as reduction in viral replication after 4 days by luci...
Ligand InfoPC cidPC sid
In DepthDetails ArticlePubMed