BDBM50452535 CHEMBL4205832
SMILES COc1cc2ccc3cc2cc1CCCCCOC(=O)N[C@H](C(=O)N1C[C@]3(C[C@H]1C(=O)N[C@@]1(C[C@H]1C=C)C(=O)NS(=O)(=O)C1CC1)OC)C(C)(C)C
InChI Key InChIKey=AXSMYGHEHYPQSD-QTFGGGKDSA-N
Data  2 EC50
  Tab Delimited (TSV)   2D SDfile   Computed 3D by Vconf -m prep SDfile
Find this compound or compounds like it in BindingDB:
Activity Spreadsheet -- Enzyme Inhibition Constant Data from BindingDB
Found 2 hits for monomerid = 50452535
TargetGenome polyprotein(Hepatitis C virus)
Bristol-Myers Squibb
Curated by ChEMBL
LigandPNGBDBM50452535(CHEMBL4205832)
Affinity DataEC50:  2nM. Assay description: Inhibition of HCV genotype 1a H77 NS3 protease infected in human HuH7 replicon cells assessed as reduction in viral replication after 4 days by lucif...
Ligand InfoPC cidPC sid
In DepthDetails ArticlePubMed
TargetGenome polyprotein(Hepatitis C virus)
Bristol-Myers Squibb
Curated by ChEMBL
LigandPNGBDBM50452535(CHEMBL4205832)
Affinity DataEC50:  0.600nM. Assay description: Inhibition of HCV genotype 1b Con1 NS3 protease infected in human HuH7 replicon cells assessed as reduction in viral replication after 4 days by luci...
Ligand InfoPC cidPC sid
In DepthDetails ArticlePubMed