BDBM50452756 CHEMBL2051756
SMILES OC(=O)C(O)=O.Oc1cccc(c1)C1CCC2CCCCN2C1
InChI Key InChIKey=IXLZJCYTLAFFMV-UHFFFAOYSA-N
Data  2 IC50
  Tab Delimited (TSV)   2D SDfile   Computed 3D by Vconf -m prep SDfile
Find this compound or compounds like it in BindingDB:
Activity Spreadsheet -- Enzyme Inhibition Constant Data from BindingDB
Found 2 hits for monomerid = 50452756
TargetD(2) dopamine receptor(Rattus norvegicus (rat))
University Of Lund
Curated by ChEMBL
LigandPNGBDBM50452756(CHEMBL2051756)
Affinity DataIC50:  7.90E+3nM. Assay description: In vitro inhibition of [3H]-N-0437 binding to Dopamine receptor D2 in rat striatal membranes
In DepthDetails ArticlePubMed
TargetD(2) dopamine receptor(Rattus norvegicus (rat))
University Of Lund
Curated by ChEMBL
LigandPNGBDBM50452756(CHEMBL2051756)
Affinity DataIC50:  4.00E+4nM. Assay description: In vitro inhibition of [3H]-spiperone binding to Dopamine receptor D2 in rat striatal membranes
In DepthDetails ArticlePubMed