BDBM50452985 CHEMBL2114234
SMILES CCCCCCN1CCC[C@@H]1CNC(=O)c1cc(cc2C[C@H](C)Oc12)S(N)(=O)=O
InChI Key InChIKey=SHWNENMUVQNYBC-DOTOQJQBSA-N
Data  1 KI
  Tab Delimited (TSV)   2D SDfile   Computed 3D by Vconf -m prep SDfile
Find this compound or compounds like it in BindingDB:
Activity Spreadsheet -- Enzyme Inhibition Constant Data from BindingDB
Found 1 hit for monomerid = 50452985
TargetD(2) dopamine receptor(Rattus norvegicus (rat))
Yoshitomi Pharmaceutical Industries
Curated by ChEMBL
LigandPNGBDBM50452985(CHEMBL2114234)
Affinity DataKi:  6.70nM. Assay description: Binding affinity towards dopamine receptor D2 using as [3H]-spiperone radioligand.
In DepthDetails ArticlePubMed