BDBM50453096 CHEMBL2310854
SMILES [H][C@@]12CCC([C@H]([C@H](C1)c1ccc(NC(=O)CC)cc1)C(=O)OC)N2C
InChI Key InChIKey=NJRKQUXFDHDYET-QYFVKBAZSA-N
Data  2 IC50
  Tab Delimited (TSV)   2D SDfile   Computed 3D by Vconf -m prep SDfile
Find this compound or compounds like it in BindingDB:
Activity Spreadsheet -- Enzyme Inhibition Constant Data from BindingDB
Found 2 hits for monomerid = 50453096
TargetSodium-dependent dopamine transporter(Rattus norvegicus (rat))
Research Triangle Institute
Curated by ChEMBL
LigandPNGBDBM50453096(CHEMBL2310854)
Affinity DataIC50:  121nM. Assay description: Concentration required to inhibit 50% of radioligand binding ([3H]WIN-35428) to the dopamine (DA) transporter in rat
In DepthDetails ArticlePubMed
TargetSodium-dependent dopamine transporter(Rattus norvegicus (rat))
Research Triangle Institute
Curated by ChEMBL
LigandPNGBDBM50453096(CHEMBL2310854)
Affinity DataIC50:  68nM. Assay description: Affinity against cocaine binding site of dopamine transporter in rat striatum using [3H]2b as radioligand.
In DepthDetails ArticlePubMed