BDBM50453214 CHEMBL2113498
SMILES Nc1nc(nc2n(cnc12)[C@@H]1O[C@H](CO)[C@@H](O)[C@H]1O)C#CC1(O)CCCCCCC1
InChI Key InChIKey=OUCLCSGSTIHYBH-BGIGGGFGSA-N
Data  2 KI
  Tab Delimited (TSV)   2D SDfile   Computed 3D by Vconf -m prep SDfile
Find this compound or compounds like it in BindingDB:
Activity Spreadsheet -- Enzyme Inhibition Constant Data from BindingDB
Found 2 hits for monomerid = 50453214
TargetAdenosine receptor A2a/A2b(Rattus norvegicus)
Yamasa Shoyu
Curated by ChEMBL
LigandPNGBDBM50453214(CHEMBL2113498)
Affinity DataKi:  1.90nM. Assay description: Inhibition of [3H]NECA binding to adenosine A2 receptor from rat striatal membranes
In DepthDetails ArticlePubMed
TargetAdenosine receptor A1(Rattus norvegicus (rat))
Yamasa Shoyu
Curated by ChEMBL
LigandPNGBDBM50453214(CHEMBL2113498)
Affinity DataKi:  56nM. Assay description: Inhibition of [3H]CHA binding to adenosine A1 receptor from rat brain membranes
In DepthDetails ArticlePubMed