BDBM50453308 CHEMBL2079545
SMILES [H][C@@]12Cc3cccc(OC)c3[C@]1([H])CCN(CCCCN1C(=O)CC3(CCCC3)CC1=O)C2
InChI Key InChIKey=OTWHMVOGGXUZCR-LEWJYISDSA-N
Data  2 KI
  Tab Delimited (TSV)   2D SDfile   Computed 3D by Vconf -m prep SDfile
Find this compound or compounds like it in BindingDB:
Activity Spreadsheet -- Enzyme Inhibition Constant Data from BindingDB
Found 2 hits for monomerid = 50453308
Target5-hydroxytryptamine receptor 1A(Rattus norvegicus (rat))
Abbott Laboratories
Curated by ChEMBL
LigandPNGBDBM50453308(CHEMBL2079545)
Affinity DataKi:  55nM. Assay description: Binding affinity for 5-hydroxytryptamine 1A receptor with [3H]5-HT
In DepthDetails ArticlePubMed
Target5-hydroxytryptamine receptor 1B(Rattus norvegicus (Rat))
Abbott Laboratories
Curated by ChEMBL
LigandPNGBDBM50453308(CHEMBL2079545)
Affinity DataKi:  1.36E+4nM. Assay description: Inhibition of [3H]5-HT binding to 5-hydroxytryptamine 1B receptor
In DepthDetails ArticlePubMed