BDBM50453501 CHEMBL2113597
SMILES CC(C)n1cc(CCNc2ncnc3n(cnc23)[C@@H]2O[C@@H]([C@@H](O)[C@H]2O)C(=O)NC2CC2)c2ccccc12
InChI Key InChIKey=AQPWGENGSGIMGJ-IMIIHFCZSA-N
Data  1 KI
  Tab Delimited (TSV)   2D SDfile   Computed 3D by Vconf -m prep SDfile
Find this compound or compounds like it in BindingDB:
Activity Spreadsheet -- Enzyme Inhibition Constant Data from BindingDB
Found 1 hit for monomerid = 50453501
TargetAdenosine receptor A1(Rattus norvegicus (rat))
Carpibem
Curated by ChEMBL
LigandPNGBDBM50453501(CHEMBL2113597)
Affinity DataKi:  120nM. Assay description: Binding affinity for adenosine A1 receptor in vitro using rat brain membranes.
In DepthDetails ArticlePubMed