BDBM50454204 CHEMBL2114186
SMILES C[C@@H](Cc1ccccc1)n1c2ccccc2c2c(N)nc(nc12)-c1ccccc1
InChI Key InChIKey=ZLDAYRVAIQOCCR-KRWDZBQOSA-N
Data  2 KI
  Tab Delimited (TSV)   2D SDfile   Computed 3D by Vconf -m prep SDfile
Find this compound or compounds like it in BindingDB:
Activity Spreadsheet -- Enzyme Inhibition Constant Data from BindingDB
Found 2 hits for monomerid = 50454204
TargetAdenosine receptor A1(Rattus norvegicus (rat))
Julius-Maximilians-UniversitäT WüRzburg
Curated by ChEMBL
LigandPNGBDBM50454204(CHEMBL2114186)
Affinity DataKi:  320nM. Assay description: Radioligand binding assay for [3H]-PIA affinity towards Adenosine A1 receptor of rat cerebral cortical membrane
In DepthDetails ArticlePubMed
TargetAdenosine receptor A2a(Rattus norvegicus (rat))
Julius-Maximilians-UniversitäT WüRzburg
Curated by ChEMBL
LigandPNGBDBM50454204(CHEMBL2114186)
Affinity DataKi: >3.00E+4nM. Assay description: Radioligand binding assay for [3H]-NECA affinity towards adenosine A2A receptor of rat striatum
In DepthDetails ArticlePubMed