BDBM50454322 CHEMBL4218731
SMILES COc1c(O)ccc2c1oc1c3c(OC(CO)C3(C)C)cc(O)c1c2=O
InChI Key InChIKey=DGPPUQGDNLFZCD-UHFFFAOYSA-N
Data  2 KI  2 IC50
  Tab Delimited (TSV)   2D SDfile   Computed 3D by Vconf -m prep SDfile
Find this compound or compounds like it in BindingDB:
Activity Spreadsheet -- Enzyme Inhibition Constant Data from BindingDB
Found 4 hits for monomerid = 50454322
TargetTyrosine-protein phosphatase non-receptor type 1(Homo sapiens (Human))
Gyeongsang National University
Curated by ChEMBL
LigandPNGBDBM50454322(CHEMBL4218731)
Affinity DataKi:  3.27E+4nM. Assay description: Inhibition of recombinant human PTP1B (1 to 322 residues) expressed in Escherichia coli using P-NPP as substrate after 10 mins by Dixon plot analysis
Ligand InfoPC cidPC sid
In DepthDetails ArticlePubMed
TargetProbable maltase-glucoamylase 2(Homo sapiens)
Gyeongsang National University
Curated by ChEMBL
LigandPNGBDBM50454322(CHEMBL4218731)
Affinity DataKi:  3.39E+4nM. Assay description: Inhibition of alpha-glucosidase (unknown origin) using PNP-G as substrate by Dixon plot analysis
Ligand InfoPC cidPC sid
In DepthDetails ArticlePubMed
TargetTyrosine-protein phosphatase non-receptor type 1(Homo sapiens (Human))
Gyeongsang National University
Curated by ChEMBL
LigandPNGBDBM50454322(CHEMBL4218731)
Affinity DataIC50:  5.25E+4nM. Assay description: Inhibition of recombinant human PTP1B (1 to 322 residues) expressed in Escherichia coli using P-NPP as substrate after 10 mins by spectrophotometry
Ligand InfoPC cidPC sid
In DepthDetails ArticlePubMed
TargetProbable maltase-glucoamylase 2(Homo sapiens)
Gyeongsang National University
Curated by ChEMBL
LigandPNGBDBM50454322(CHEMBL4218731)
Affinity DataIC50:  7.27E+4nM. Assay description: Inhibition of alpha-glucosidase (unknown origin) using PNP-G as substrate measured for 15 mins by spectrophotometry
Ligand InfoPC cidPC sid
In DepthDetails ArticlePubMed