BDBM50455157 Cortisone::Cortisone acetate::Cortone
SMILES [H][C@@]12CC[C@](O)(C(=O)COC(C)=O)[C@@]1(C)CC(=O)[C@@]1([H])[C@@]2([H])CCC2=CC(=O)CC[C@]12C
InChI Key InChIKey=ITRJWOMZKQRYTA-RFZYENFJSA-N
Data  1 IC50
  Tab Delimited (TSV)   2D SDfile   Computed 3D by Vconf -m prep SDfile
Find this compound or compounds like it in BindingDB:
Activity Spreadsheet -- Enzyme Inhibition Constant Data from BindingDB
Found 1 hit for monomerid = 50455157
TargetProtein farnesyltransferase subunit beta/geranylgeranyltransferase type-1 subunit alpha(Homo sapiens (Human))
Merck Research Laboratories
Curated by ChEMBL
LigandPNGBDBM50455157(Cortisone | Cortisone acetate | Cortone)
Affinity DataIC50:  1.40E+4nM. Assay description: inhibitory activity against human Farnesyltransferase
In DepthDetails ArticlePubMed