BDBM50455605 2-(l-hexyn-l-yl)-adenosine-5'-N-methyluronamide (16f)::CHEMBL2113481
SMILES CCCCNC(=O)[C@H]1O[C@H]([C@H](O)[C@@H]1O)n1cnc2c(N)nc(nc12)C#CCCCC
InChI Key InChIKey=WWKUVWQDKNVTDS-KSVNGYGVSA-N
Data  3 KI
  Tab Delimited (TSV)   2D SDfile   Computed 3D by Vconf -m prep SDfile
Find this compound or compounds like it in BindingDB:
Activity Spreadsheet -- Enzyme Inhibition Constant Data from BindingDB
Found 3 hits for monomerid = 50455605
TargetAdenosine receptor A2a(Rattus norvegicus (rat))
Hokkaido University
Curated by ChEMBL
LigandPNGBDBM50455605(2-(l-hexyn-l-yl)-adenosine-5'-N-methyluronamide (1...)
Affinity DataKi:  169nM. Assay description: Binding affinity against adenosine A1 receptor from rat brain membranes using [3H]cyclohexyladenosine as radioligand.
In DepthDetails ArticlePubMed
TargetAdenosine receptor A2a/A2b(Rattus norvegicus)
Hokkaido University
Curated by ChEMBL
LigandPNGBDBM50455605(2-(l-hexyn-l-yl)-adenosine-5'-N-methyluronamide (1...)
Affinity DataKi:  169nM. Assay description: Binding affinity against adenosine A2 receptor from rat striatum using [3H]NECA as radioligand.
In DepthDetails ArticlePubMed
TargetAdenosine receptor A1(Rattus norvegicus (rat))
Hokkaido University
Curated by ChEMBL
LigandPNGBDBM50455605(2-(l-hexyn-l-yl)-adenosine-5'-N-methyluronamide (1...)
Affinity DataKi:  1.93E+3nM. Assay description: Binding affinity against adenosine A1 receptor from rat brain membranes using [3H]cyclohexyladenosine as radioligand.
In DepthDetails ArticlePubMed