BDBM50455634 CHEMBL2113522
SMILES CCC#Cc1nc(N)c2ncn([C@@H]3O[C@H](CO)[C@@H](O)[C@H]3O)c2n1
InChI Key InChIKey=NWEKQQYEGVHHCI-FRJWGUMJSA-N
Data  2 KI
  Tab Delimited (TSV)   2D SDfile   Computed 3D by Vconf -m prep SDfile
Find this compound or compounds like it in BindingDB:
Activity Spreadsheet -- Enzyme Inhibition Constant Data from BindingDB
Found 2 hits for monomerid = 50455634
TargetAdenosine receptor A2a/A2b(Rattus norvegicus)
Hokkaido University
Curated by ChEMBL
LigandPNGBDBM50455634(CHEMBL2113522)
Affinity DataKi:  21nM. Assay description: Binding affinity against adenosine A2 receptor in rat striatal membranes using [3H]NECA as radioligand
In DepthDetails ArticlePubMed
TargetAdenosine receptor A1(Rattus norvegicus (rat))
Hokkaido University
Curated by ChEMBL
LigandPNGBDBM50455634(CHEMBL2113522)
Affinity DataKi:  186nM. Assay description: Binding affinity against adenosine A1 receptor in rat brain membranes using [3H]CHA as radioligand
In DepthDetails ArticlePubMed