BDBM50455705 CHEMBL3907641
SMILES CN(Cc1cccs1)C(=O)c1cc(-c2n[nH]c(=O)n2-c2ccccc2C)c(O)cc1O
InChI Key InChIKey=VAHNSEIURMSJCK-UHFFFAOYSA-N
Data  1 Kd
PDB links: 1 PDB ID matches this monomer.
  Tab Delimited (TSV)   2D SDfile   Computed 3D by Vconf -m prep SDfile
Find this compound or compounds like it in BindingDB:
Activity Spreadsheet -- Enzyme Inhibition Constant Data from BindingDB
Found 1 hit for monomerid = 50455705
TargetHeat shock protein HSP 90-alpha/90-beta(Homo sapiens (Human))
University Of Vienna
Curated by ChEMBL
LigandPNGBDBM50455705(CHEMBL3907641)
Affinity DataKd:  3.80nM. Assay description: Binding affinity to recombinant N-terminal Hsp90 (unknown origin) by SPR method
Ligand InfoPC cidPC sidPDB