BDBM50455988 CHEMBL2115359
SMILES O=C1CCCN1CC#CC[C@H]1CCCN1
InChI Key InChIKey=QUNNKIIZGPBYSY-NSHDSACASA-N
Data  2 KI
  Tab Delimited (TSV)   2D SDfile   Computed 3D by Vconf -m prep SDfile
Find this compound or compounds like it in BindingDB:
Activity Spreadsheet -- Enzyme Inhibition Constant Data from BindingDB
Found 2 hits for monomerid = 50455988
TargetMuscarinic acetylcholine receptor M2(RAT)
Abbott Laboratories
Curated by ChEMBL
LigandPNGBDBM50455988(CHEMBL2115359)
Affinity DataKi:  2.46E+3nM. Assay description: Compound was evaluated for its binding affinity towards M2 receptor in rat brainstem
In DepthDetails ArticlePubMed
TargetMuscarinic acetylcholine receptor M1(RAT)
Abbott Laboratories
Curated by ChEMBL
LigandPNGBDBM50455988(CHEMBL2115359)
Affinity DataKi:  3.07E+3nM. Assay description: Compound was evaluated for its binding affinity towards M1 receptor in rat cortex
In DepthDetails ArticlePubMed