BDBM50456333 CHEMBL2371361
SMILES C[C@H](NC(=O)[C@@H](N)Cc1ccc(O)cc1)C(=O)N[C@@H](Cc1ccccc1)C(=O)N1CCC[C@@H]1C(N)=O
InChI Key InChIKey=FXLMJAFFLZEZHN-IRNNPGBSSA-N
Data  2 IC50
  Tab Delimited (TSV)   2D SDfile   Computed 3D by Vconf -m prep SDfile
Find this compound or compounds like it in BindingDB:
Activity Spreadsheet -- Enzyme Inhibition Constant Data from BindingDB
Found 2 hits for monomerid = 50456333
TargetDelta-type opioid receptor(MOUSE)
University Of California
Curated by ChEMBL
LigandPNGBDBM50456333(CHEMBL2371361)
Affinity DataIC50: >1.00E+5nM. Assay description: In vitro inhibitory activity against delta opioid receptor using mouse vas deferens (MVD) assay
In DepthDetails ArticlePubMed
TargetMu-type opioid receptor(GUINEA PIG)
University Of California
Curated by ChEMBL
LigandPNGBDBM50456333(CHEMBL2371361)
Affinity DataIC50:  2.69E+4nM. Assay description: In vitro inhibitory activity against mu opioid receptor using guinea pig ileum (GPI) assay
In DepthDetails ArticlePubMed