BDBM50456335 CHEMBL2371359
SMILES N[C@@H](Cc1ccc(O)cc1)C(=O)N1CCC[C@H]1C(=O)N[C@H](Cc1ccccc1)C(=O)N1CCC[C@H]1C(N)=O
InChI Key InChIKey=LSQXZIUREIDSHZ-KIHHCIJBSA-N
Data  2 IC50
  Tab Delimited (TSV)   2D SDfile   Computed 3D by Vconf -m prep SDfile
Find this compound or compounds like it in BindingDB:
Activity Spreadsheet -- Enzyme Inhibition Constant Data from BindingDB
Found 2 hits for monomerid = 50456335
TargetDelta-type opioid receptor(MOUSE)
University Of California
Curated by ChEMBL
LigandPNGBDBM50456335(CHEMBL2371359)
Affinity DataIC50:  594nM. Assay description: In vitro inhibitory activity against delta opioid receptor using mouse vas deferens (MVD) assay
In DepthDetails ArticlePubMed
TargetMu-type opioid receptor(GUINEA PIG)
University Of California
Curated by ChEMBL
LigandPNGBDBM50456335(CHEMBL2371359)
Affinity DataIC50:  109nM. Assay description: In vitro inhibitory activity against mu opioid receptor using guinea pig ileum (GPI) assay
In DepthDetails ArticlePubMed