BDBM50458054 Albac 50::Baci-Rx::Baciferm 50::Baciguent::Baciim::Bacitracin::CHEBI:35862::E700
SMILES [H][C@]1(NC(=O)[C@@H](CCCN)NC(=O)[C@H](CCCCNC(=O)[C@H](CC(N)=O)NC(=O)[C@@H](CC(O)=O)NC(=O)[C@H](Cc2cnc[nH]2)NC(=O)[C@@H](Cc2ccccc2)NC1=O)NC(=O)[C@@H](NC(=O)[C@@H](CCC(O)=O)NC(=O)[C@H](CC(C)C)NC(=O)[C@@H]1CSC(=N1)[C@@H](N)[C@@H](C)CC)[C@@H](C)CC)[C@@H](C)CC
InChI Key InChIKey=CLKOFPXJLQSYAH-ABRJDSQDSA-N
Data  2 IC50
  Tab Delimited (TSV)   2D SDfile   Computed 3D by Vconf -m prep SDfile
Find this compound or compounds like it in BindingDB:
Activity Spreadsheet -- Enzyme Inhibition Constant Data from BindingDB
Found 2 hits for monomerid = 50458054
TargetUndecaprenyl-diphosphatase(Escherichia coli (strain K12))
Al-Azhar University
Curated by ChEMBL
LigandPNGBDBM50458054(Albac 50 | Baci-Rx | Baciferm 50 | Baciguent | Bac...)
Affinity DataIC50:  5.60E+3nM. Assay description: Inhibition of Escherichia coli UPPP expressed in Escherichia coli C41(DE3) using FPP as substrate preincubated for 15 mins followed by substrate addi...
In DepthDetails ArticlePubMed
TargetInsulin-degrading enzyme(Mus musculus (Mouse))
Peking University Shenzhen Graduate School
Curated by ChEMBL
LigandPNGBDBM50458054(Albac 50 | Baci-Rx | Baciferm 50 | Baciguent | Bac...)
Affinity DataIC50: >2.00E+5nM. Assay description: Inhibition of mouse His-tagged IDE (42 to 1019 residues) using fluorophore/quencher-tagged RPPGFSAFK(Dnp)-OH peptide as substrate preincubated for 10...
In DepthDetails ArticlePubMed