BDBM50458463 CHEMBL4213159
SMILES [Na;v0+].[#6]-[#6](-[#6])-[#6]-[#6@H](-[#7]-[#6](=O)-[#8]-[#6]-1-[#6]-[#6]-[#7](-[#6]-[#6]-1)S([#6])(=O)=O)-[#6](=O)-[#7]-[#6@@H](-[#6]-[#6@@H]-1-[#6]-[#6]-[#7]-[#6]-1=O)-[#6](-[#8])S([#8-])(=O)=O
InChI Key InChIKey=OXYUFTIDAUNJGP-KEWDJMNSSA-M
Data  3 IC50
  Tab Delimited (TSV)   2D SDfile   Computed 3D by Vconf -m prep SDfile
Find this compound or compounds like it in BindingDB:
Activity Spreadsheet -- Enzyme Inhibition Constant Data from BindingDB
Found 3 hits for monomerid = 50458463
TargetReplicase polyprotein 1ab(Human SARS coronavirus (SARS-CoV) (Severe acute re...)
Wichita State University
Curated by ChEMBL
LigandPNGBDBM50458463(CHEMBL4213159)
Affinity DataIC50:  4.21E+4nM. Assay description: Inhibition of SARS coronavirus 3CL protease using Dabcyl-KTSAVLQ/SGFRKME-Edans as substrate incubated for 30 mins followed by substrate addition meas...
Ligand InfoPC cidPC sid
In DepthDetails ArticlePubMed
TargetReplicase polyprotein 1ab(Middle East respiratory syndrome-related coronavir...)
Wichita State University
Curated by ChEMBL
LigandPNGBDBM50458463(CHEMBL4213159)
Affinity DataIC50:  600nM. Assay description: Inhibition of Middle East respiratory syndrome-related coronavirus 3CL protease using Dabcyl-KTSAVLQ/SGFRKME-Edans as substrate incubated for 30 mins...
Ligand InfoPC cidPC sid
In DepthDetails ArticlePubMed
TargetReplicase polyprotein 1ab(Feline coronavirus (strain FIPV WSU-79/1146) (FCoV...)
Wichita State University
Curated by ChEMBL
LigandPNGBDBM50458463(CHEMBL4213159)
Affinity DataIC50:  2.30E+3nM. Assay description: Inhibition of Feline infectious peritonitis virus 3CL protease using Dabcyl-KTSAVLQ/SGFRKME-Edans as substrate incubated for 30 mins followed by subs...
Ligand InfoPC cidPC sid
In DepthDetails ArticlePubMed