BDBM50458703 CHEMBL4210043
SMILES COc1ccc2nc(Cl)c(O[C@@H]3C[C@H](N(C3)C(=O)[C@@H](NC(=O)OC(C)(C)C)C(C)(C)C)C(=O)N[C@@]3(C[C@H]3C=C)C(=O)NS(=O)(=O)C3CC3)nc2c1
InChI Key InChIKey=FHGKQAWOBNPFKL-FRGGWNFZSA-N
Data  3 KI
  Tab Delimited (TSV)   2D SDfile   Computed 3D by Vconf -m prep SDfile
Find this compound or compounds like it in BindingDB:
Activity Spreadsheet -- Enzyme Inhibition Constant Data from BindingDB
Found 3 hits for monomerid = 50458703
TargetGenome polyprotein/Non-structural protein 4A(Hepatitis C virus)
University Of Massachusetts Medical School
Curated by ChEMBL
LigandPNGBDBM50458703(CHEMBL4210043)
Affinity DataKi:  2.20nM. Assay description: Inhibition of HCV genotype 1a NS3/4A protease R155K mutant expressed in Escherichia coli BL21(DE3) using Ac-DE-Dap(QXL 520)-EE-Abu-psi-[COO]AS-C(5-FA...
Ligand InfoPC cidPC sid
In DepthDetails ArticlePubMed
TargetGenome polyprotein/Non-structural protein 4A(Hepatitis C virus)
University Of Massachusetts Medical School
Curated by ChEMBL
LigandPNGBDBM50458703(CHEMBL4210043)
Affinity DataKi:  7.80nM. Assay description: Inhibition of wild type HCV genotype 1a NS3/4A protease expressed in Escherichia coli BL21(DE3) using Ac-DE-Dap(QXL 520)-EE-Abu-psi-[COO]AS-C(5-FAMsp...
Ligand InfoPC cidPC sid
In DepthDetails ArticlePubMed
TargetGenome polyprotein/Non-structural protein 4A(Hepatitis C virus)
University Of Massachusetts Medical School
Curated by ChEMBL
LigandPNGBDBM50458703(CHEMBL4210043)
Affinity DataKi:  128nM. Assay description: Inhibition of HCV genotype 1a NS3/4A protease D168A mutant expressed in Escherichia coli BL21(DE3) using Ac-DE-Dap(QXL 520)-EE-Abu-psi-[COO]AS-C(5-FA...
Ligand InfoPC cidPC sid
In DepthDetails ArticlePubMed