BDBM50460727 CHEMBL4226392
SMILES Nc1nc(c(s1)C(=O)c1ccccc1Br)-c1cccc(c1)C(F)(F)F
InChI Key InChIKey=KSAFJYONAATXPX-UHFFFAOYSA-N
Data  2 IC50
  Tab Delimited (TSV)   2D SDfile   Computed 3D by Vconf -m prep SDfile
Find this compound or compounds like it in BindingDB:
Activity Spreadsheet -- Enzyme Inhibition Constant Data from BindingDB
Found 2 hits for monomerid = 50460727
TargetNuclear receptor ROR-beta(Homo sapiens (Human))
The Scripps Research Institute
Curated by ChEMBL
LigandPNGBDBM50460727(CHEMBL4226392)
Affinity DataIC50:  110nM. Assay description: Displacement of [3H]-T0901317 from recombinant human His-SUMO-tagged RORbeta LBD (71 to 459 residues) expressed in Escherichia coli BL21(DE3) at afte...
Ligand InfoPC cidPC sid
In DepthDetails ArticlePubMed
TargetNuclear receptor ROR-gamma(Homo sapiens (Human))
The Scripps Research Institute
Curated by ChEMBL
LigandPNGBDBM50460727(CHEMBL4226392)
Affinity DataIC50: >4.00E+4nM. Assay description: Displacement of [3H]-T0901317 from recombinant human His-SUMO-tagged RORgamma LBD (265 to 518 residues) expressed in Escherichia coli BL21(DE3) at af...
Ligand InfoPC cidPC sid
In DepthDetails ArticlePubMed