BDBM50461545 CHEMBL4226876
SMILES COc1ccc2c(O[C@@H]3C[C@H](N(C3)C(=O)[C@@H](NC(=O)N[C@H](C(=O)OC(C)(C)C)C(C)(C)C)C(C)(C)C)C(=O)N[C@@]3(C[C@H]3C=C)C(=O)NS(=O)(=O)C3CC3)nccc2c1
InChI Key InChIKey=LBMJODLMTHMDGD-WEJBUAJGSA-N
Data  3 IC50
  Tab Delimited (TSV)   2D SDfile   Computed 3D by Vconf -m prep SDfile
Find this compound or compounds like it in BindingDB:
Activity Spreadsheet -- Enzyme Inhibition Constant Data from BindingDB
Found 3 hits for monomerid = 50461545
TargetGenome polyprotein/Non-structural protein 4A(Hepatitis C virus)
Bristol-Myers Squibb Research And Development
Curated by ChEMBL
LigandPNGBDBM50461545(CHEMBL4226876)
Affinity DataIC50:  0.190nM. Assay description: Inhibition of N-terminal poly-His tagged recombinant HCV genotype 1a NS3/4A protease expressed in Escherichia coli BL21(DE3) pLysS using HCV-FRET pep...
Ligand InfoPC cidPC sid
In DepthDetails ArticlePubMed
TargetGenome polyprotein/Non-structural protein 4A(Hepatitis C virus)
Bristol-Myers Squibb Research And Development
Curated by ChEMBL
LigandPNGBDBM50461545(CHEMBL4226876)
Affinity DataIC50:  93nM. Assay description: Inhibition of N-terminal poly-His tagged recombinant HCV genotype 3a NS3/4A protease expressed in Escherichia coli BL21(DE3) pLysS using HCV-FRET pep...
Ligand InfoPC cidPC sid
In DepthDetails ArticlePubMed
TargetGenome polyprotein/Non-structural protein 4A(Hepatitis C virus)
Bristol-Myers Squibb Research And Development
Curated by ChEMBL
LigandPNGBDBM50461545(CHEMBL4226876)
Affinity DataIC50:  59nM. Assay description: Inhibition of N-terminal poly-His tagged recombinant HCV genotype 2b NS3/4A protease expressed in Escherichia coli BL21(DE3) pLysS using HCV-FRET pep...
Ligand InfoPC cidPC sid
In DepthDetails ArticlePubMed