BDBM50461550 CHEMBL2403888
SMILES COc1ccc2c(O[C@@H]3C[C@H](N(C3)C(=O)[C@@H](NC(=O)OC(C)(C)C)C(C)(C)C)C(=O)N[C@@]3(C[C@H]3C=C)C(=O)NS(=O)(=O)C3CC3)nccc2c1
InChI Key InChIKey=IYWRCNFZPNEADN-CXODAYGWSA-N
Data  4 IC50
PDB links: 1 PDB ID matches this monomer.
  Tab Delimited (TSV)   2D SDfile   Computed 3D by Vconf -m prep SDfile
Find this compound or compounds like it in BindingDB:
Activity Spreadsheet -- Enzyme Inhibition Constant Data from BindingDB
Found 4 hits for monomerid = 50461550
TargetCytochrome P450 3A4(Homo sapiens (Human))
Bristol-Myers Squibb Research And Development
Curated by ChEMBL
LigandPNGBDBM50461550(CHEMBL2403888)
Affinity DataIC50:  2.00E+3nM. Assay description: Inhibition of CYP3A4 (unknown origin)
Ligand InfoPC cidPC sidPDB
In DepthDetails ArticlePubMed
TargetGenome polyprotein/Non-structural protein 4A(Hepatitis C virus)
Bristol-Myers Squibb Research And Development
Curated by ChEMBL
LigandPNGBDBM50461550(CHEMBL2403888)
Affinity DataIC50:  95nM. Assay description: Inhibition of N-terminal poly-His tagged recombinant HCV genotype 3a NS3/4A protease expressed in Escherichia coli BL21(DE3) pLysS using HCV-FRET pep...
Ligand InfoPC cidPC sidPDB
TargetGenome polyprotein/Non-structural protein 4A(Hepatitis C virus)
Bristol-Myers Squibb Research And Development
Curated by ChEMBL
LigandPNGBDBM50461550(CHEMBL2403888)
Affinity DataIC50:  187nM. Assay description: Inhibition of N-terminal poly-His tagged recombinant HCV genotype 2b NS3/4A protease expressed in Escherichia coli BL21(DE3) pLysS using HCV-FRET pep...
Ligand InfoPC cidPC sidPDB
TargetGenome polyprotein/Non-structural protein 4A(Hepatitis C virus)
Bristol-Myers Squibb Research And Development
Curated by ChEMBL
LigandPNGBDBM50461550(CHEMBL2403888)
Affinity DataIC50:  2nM. Assay description: Inhibition of N-terminal poly-His tagged recombinant HCV genotype 1a NS3/4A protease expressed in Escherichia coli BL21(DE3) pLysS using HCV-FRET pep...
Ligand InfoPC cidPC sidPDB