BDBM50461554 CHEMBL4225514
SMILES CC[C@H](C)[C@@H](COC)NC(=O)N[C@H](C(=O)N1C[C@@H](C[C@H]1C(=O)N[C@@]1(C[C@H]1C=C)C(=O)NS(=O)(=O)C1CC1)Oc1nccc2cc(OC)ccc12)C(C)(C)C
InChI Key InChIKey=XFXQDMHDNGOKBW-VIUIDIRRSA-N
Data  3 IC50
  Tab Delimited (TSV)   2D SDfile   Computed 3D by Vconf -m prep SDfile
Find this compound or compounds like it in BindingDB:
Activity Spreadsheet -- Enzyme Inhibition Constant Data from BindingDB
Found 3 hits for monomerid = 50461554
TargetGenome polyprotein/Non-structural protein 4A(Hepatitis C virus)
Bristol-Myers Squibb Research And Development
Curated by ChEMBL
LigandPNGBDBM50461554(CHEMBL4225514)
Affinity DataIC50:  0.400nM. Assay description: Inhibition of N-terminal poly-His tagged recombinant HCV genotype 1a NS3/4A protease expressed in Escherichia coli BL21(DE3) pLysS using HCV-FRET pep...
Ligand InfoPC cidPC sid
In DepthDetails ArticlePubMed
TargetGenome polyprotein/Non-structural protein 4A(Hepatitis C virus)
Bristol-Myers Squibb Research And Development
Curated by ChEMBL
LigandPNGBDBM50461554(CHEMBL4225514)
Affinity DataIC50:  72nM. Assay description: Inhibition of N-terminal poly-His tagged recombinant HCV genotype 3a NS3/4A protease expressed in Escherichia coli BL21(DE3) pLysS using HCV-FRET pep...
Ligand InfoPC cidPC sid
In DepthDetails ArticlePubMed
TargetGenome polyprotein/Non-structural protein 4A(Hepatitis C virus)
Bristol-Myers Squibb Research And Development
Curated by ChEMBL
LigandPNGBDBM50461554(CHEMBL4225514)
Affinity DataIC50:  17nM. Assay description: Inhibition of N-terminal poly-His tagged recombinant HCV genotype 2b NS3/4A protease expressed in Escherichia coli BL21(DE3) pLysS using HCV-FRET pep...
Ligand InfoPC cidPC sid
In DepthDetails ArticlePubMed