BDBM50461557 CHEMBL414993
SMILES [H][C@]1(C[C@H](CN1C(=O)[C@@H](NC(=O)OC(C)(C)C)C(C)(C)C)Oc1cc(nc2cc(OC)ccc12)-c1ccccc1)C(=O)N[C@@]1(C[C@H]1C=C)C(=O)NS(=O)(=O)C1CC1
InChI Key InChIKey=YMHQYWPVQDRYSQ-LMPQEXDPSA-N
Data  3 IC50
  Tab Delimited (TSV)   2D SDfile   Computed 3D by Vconf -m prep SDfile
Find this compound or compounds like it in BindingDB:
Activity Spreadsheet -- Enzyme Inhibition Constant Data from BindingDB
Found 3 hits for monomerid = 50461557
TargetGenome polyprotein/Non-structural protein 4A(Hepatitis C virus)
Bristol-Myers Squibb Research And Development
Curated by ChEMBL
LigandPNGBDBM50461557(CHEMBL414993)
Affinity DataIC50:  4.5nM. Assay description: Inhibition of N-terminal poly-His tagged recombinant HCV genotype 1a NS3/4A protease expressed in Escherichia coli BL21(DE3) pLysS using HCV-FRET pep...
Ligand InfoPC cidPC sid
In DepthDetails ArticlePubMed
TargetGenome polyprotein/Non-structural protein 4A(Hepatitis C virus)
Bristol-Myers Squibb Research And Development
Curated by ChEMBL
LigandPNGBDBM50461557(CHEMBL414993)
Affinity DataIC50:  18nM. Assay description: Inhibition of N-terminal poly-His tagged recombinant HCV genotype 2b NS3/4A protease expressed in Escherichia coli BL21(DE3) pLysS using HCV-FRET pep...
Ligand InfoPC cidPC sid
In DepthDetails ArticlePubMed
TargetGenome polyprotein/Non-structural protein 4A(Hepatitis C virus)
Bristol-Myers Squibb Research And Development
Curated by ChEMBL
LigandPNGBDBM50461557(CHEMBL414993)
Affinity DataIC50:  18nM. Assay description: Inhibition of N-terminal poly-His tagged recombinant HCV genotype 3a NS3/4A protease expressed in Escherichia coli BL21(DE3) pLysS using HCV-FRET pep...
Ligand InfoPC cidPC sid
In DepthDetails ArticlePubMed