BDBM50461569 CHEMBL4228750
SMILES C[C@H](NC(C)=O)C(=S)N1C[C@H](O)C[C@H]1C(=O)NCc1ccc(cc1)-c1scnc1C
InChI Key InChIKey=WHYNNQMYHZONCV-VHSSKADRSA-N
Data  2 Kd
PDB links: 1 PDB ID matches this monomer.
  Tab Delimited (TSV)   2D SDfile   Computed 3D by Vconf -m prep SDfile
Find this compound or compounds like it in BindingDB:
Activity Spreadsheet -- Enzyme Inhibition Constant Data from BindingDB
Found 2 hits for monomerid = 50461569
TargetElongin-C(Homo sapiens (Human))
University Of Dundee
Curated by ChEMBL
LigandPNGBDBM50461569(CHEMBL4228750)
Affinity DataKd:  760nM. Assay description: Binding affinity to VBC complex (unknown origin) by ITC assay
Ligand InfoPC cidPC sidPDB
TargetElongin-C(Homo sapiens (Human))
University Of Dundee
Curated by ChEMBL
LigandPNGBDBM50461569(CHEMBL4228750)
Affinity DataKd:  1.00E+3nM. Assay description: Binding affinity to VBC complex (unknown origin) assessed as reduction of FAM-labelled HIF1alpha peptide binding by fluorescence polarization assay
Ligand InfoPC cidPC sidPDB