BDBM50462710 CHEMBL4251324
SMILES O=C(Cc1cccc(OCCCC2CCNCC2)c1)Nc1nc(cs1)-c1ccncc1
InChI Key InChIKey=IMDMAPNWXDTADU-UHFFFAOYSA-N
Data  2 KI  35 IC50
PDB links: 1 PDB ID matches this monomer.
  Tab Delimited (TSV)   2D SDfile   Computed 3D by Vconf -m prep SDfile
Find this compound or compounds like it in BindingDB:
Activity Spreadsheet -- Enzyme Inhibition Constant Data from BindingDB
Found 37 hits for monomerid = 50462710
TargetRho-associated protein kinase 1(Homo sapiens (Human))
Vertex Pharmaceuticals
Curated by ChEMBL
LigandPNGBDBM50462710(CHEMBL4251324)
Affinity DataKi:  13nM. Assay description: Inhibition of ROCK1 (6 to 553 residues) (unknown origin) using Lys-Lys-Arg-Asn-Arg-Thr-Leu-Ser-Val as substrate by pyruvate kinase-lactate dehydrogen...
Ligand InfoPC cidPC sidPDB
TargetcAMP-dependent protein kinase catalytic subunit alpha(Homo sapiens (Human))
Vertex Pharmaceuticals
Curated by ChEMBL
LigandPNGBDBM50462710(CHEMBL4251324)
Affinity DataKi: >4.00E+3nM. Assay description: Inhibition of PKAalpha (1 to 351 residues) (unknown origin) using Leu-Arg-Arg-Ala-Ser-Leu-Gly as substrate by pyruvate kinase-lactate dehydrogenase c...
Ligand InfoPC cidPC sidPDB
In DepthDetails ArticlePubMed
TargetTyrosine-protein kinase JAK3(Homo sapiens (Human))
Vertex Pharmaceuticals
Curated by ChEMBL
LigandPNGBDBM50462710(CHEMBL4251324)
Affinity DataIC50: >5.00E+3nM. Assay description: Inhibition of JAK3 (unknown origin)
Ligand InfoPC cidPC sidPDB
In DepthDetails ArticlePubMed
TargetReceptor-type tyrosine-protein kinase FLT3(Homo sapiens (Human))
Vertex Pharmaceuticals
Curated by ChEMBL
LigandPNGBDBM50462710(CHEMBL4251324)
Affinity DataIC50: >5.00E+3nM. Assay description: Inhibition of FLT-3 (unknown origin)
Ligand InfoPC cidPC sidPDB
In DepthDetails ArticlePubMed
TargetMitogen-activated protein kinase kinase kinase 8(Homo sapiens (Human))
Vertex Pharmaceuticals
Curated by ChEMBL
LigandPNGBDBM50462710(CHEMBL4251324)
Affinity DataIC50: >4.00E+3nM. Assay description: Inhibition of COT (unknown origin)
Ligand InfoPC cidPC sidPDB
In DepthDetails ArticlePubMed
TargetSerine/threonine-protein kinase PAK 1(Homo sapiens (Human))
Vertex Pharmaceuticals
Curated by ChEMBL
LigandPNGBDBM50462710(CHEMBL4251324)
Affinity DataIC50: >1.00E+4nM. Assay description: Inhibition of PAK1 (unknown origin)
Ligand InfoPC cidPC sidPDB
In DepthDetails ArticlePubMed
TargetMitogen-activated protein kinase 10(Homo sapiens (Human))
Vertex Pharmaceuticals
Curated by ChEMBL
LigandPNGBDBM50462710(CHEMBL4251324)
Affinity DataIC50: >3.30E+3nM. Assay description: Inhibition of JNK3 (unknown origin)
Ligand InfoPC cidPC sidPDB
In DepthDetails ArticlePubMed
TargetMitogen-activated protein kinase kinase kinase 7(Homo sapiens (Human))
Vertex Pharmaceuticals
Curated by ChEMBL
LigandPNGBDBM50462710(CHEMBL4251324)
Affinity DataIC50: >1.00E+4nM. Assay description: Inhibition of TAK1 (unknown origin)
Ligand InfoPC cidPC sidPDB
In DepthDetails ArticlePubMed
TargetTyrosine-protein kinase SYK(Homo sapiens (Human))
Vertex Pharmaceuticals
Curated by ChEMBL
LigandPNGBDBM50462710(CHEMBL4251324)
Affinity DataIC50: >2.50E+3nM. Assay description: Inhibition of SYK (unknown origin)
Ligand InfoPC cidPC sidPDB
In DepthDetails ArticlePubMed
TargetProto-oncogene tyrosine-protein kinase Src(Homo sapiens (Human))
Vertex Pharmaceuticals
Curated by ChEMBL
LigandPNGBDBM50462710(CHEMBL4251324)
Affinity DataIC50: >3.30E+3nM. Assay description: Inhibition of SRC (unknown origin)
Ligand InfoPC cidPC sidPDB
In DepthDetails ArticlePubMed
TargetSerine/threonine-protein kinase PLK1(Homo sapiens (Human))
Vertex Pharmaceuticals
Curated by ChEMBL
LigandPNGBDBM50462710(CHEMBL4251324)
Affinity DataIC50: >1.00E+4nM. Assay description: Inhibition of PLK1 (unknown origin)
Ligand InfoPC cidPC sidPDB
In DepthDetails ArticlePubMed
TargetProtein kinase C epsilon type(Homo sapiens (Human))
Vertex Pharmaceuticals
Curated by ChEMBL
LigandPNGBDBM50462710(CHEMBL4251324)
Affinity DataIC50: >1.00E+4nM. Assay description: Inhibition of PKC-epsilon (unknown origin)
Ligand InfoPC cidPC sidPDB
In DepthDetails ArticlePubMed
Target3-phosphoinositide-dependent protein kinase 1(Homo sapiens (Human))
Vertex Pharmaceuticals
Curated by ChEMBL
LigandPNGBDBM50462710(CHEMBL4251324)
Affinity DataIC50: >1.00E+4nM. Assay description: Inhibition of PDK1 (unknown origin)
Ligand InfoPC cidPC sidPDB
In DepthDetails ArticlePubMed
TargetMitogen-activated protein kinase kinase kinase 10(Homo sapiens (Human))
Vertex Pharmaceuticals
Curated by ChEMBL
LigandPNGBDBM50462710(CHEMBL4251324)
Affinity DataIC50: >1.00E+4nM. Assay description: Inhibition of MLK2 (unknown origin)
Ligand InfoPC cidPC sidPDB
In DepthDetails ArticlePubMed
TargetTyrosine-protein kinase Lck(Homo sapiens (Human))
Vertex Pharmaceuticals
Curated by ChEMBL
LigandPNGBDBM50462710(CHEMBL4251324)
Affinity DataIC50: >5.00E+3nM. Assay description: Inhibition of LCK (unknown origin)
Ligand InfoPC cidPC sidPDB
In DepthDetails ArticlePubMed
TargetInterleukin-1 receptor-associated kinase 4(Homo sapiens (Human))
Vertex Pharmaceuticals
Curated by ChEMBL
LigandPNGBDBM50462710(CHEMBL4251324)
Affinity DataIC50: >1.00E+4nM. Assay description: Inhibition of IRAK4 (unknown origin)
Ligand InfoPC cidPC sidPDB
In DepthDetails ArticlePubMed
TargetInterleukin-1 receptor-associated kinase 1(Homo sapiens (Human))
Vertex Pharmaceuticals
Curated by ChEMBL
LigandPNGBDBM50462710(CHEMBL4251324)
Affinity DataIC50: >1.00E+4nM. Assay description: Inhibition of IRAK1 (unknown origin)
Ligand InfoPC cidPC sidPDB
In DepthDetails ArticlePubMed
TargeteIF-2-alpha kinase GCN2(Homo sapiens (Human))
Vertex Pharmaceuticals
Curated by ChEMBL
LigandPNGBDBM50462710(CHEMBL4251324)
Affinity DataIC50: >1.00E+4nM. Assay description: Inhibition of GCN2 (unknown origin)
Ligand InfoPC cidPC sidPDB
In DepthDetails ArticlePubMed
TargetMitogen-activated protein kinase kinase kinase kinase 2(Homo sapiens (Human))
Vertex Pharmaceuticals
Curated by ChEMBL
LigandPNGBDBM50462710(CHEMBL4251324)
Affinity DataIC50: >5.00E+3nM. Assay description: Inhibition of GCK (unknown origin)
Ligand InfoPC cidPC sidPDB
In DepthDetails ArticlePubMed
TargetFocal adhesion kinase 1(Homo sapiens (Human))
Vertex Pharmaceuticals
Curated by ChEMBL
LigandPNGBDBM50462710(CHEMBL4251324)
Affinity DataIC50: >1.00E+4nM. Assay description: Inhibition of FAK (unknown origin)
Ligand InfoPC cidPC sidPDB
In DepthDetails ArticlePubMed
TargetAurora kinase C(Homo sapiens (Human))
Vertex Pharmaceuticals
Curated by ChEMBL
LigandPNGBDBM50462710(CHEMBL4251324)
Affinity DataIC50: >5.00E+3nM. Assay description: Inhibition of AURC (unknown origin)
Ligand InfoPC cidPC sidPDB
In DepthDetails ArticlePubMed
TargetAurora kinase B(Homo sapiens (Human))
Vertex Pharmaceuticals
Curated by ChEMBL
LigandPNGBDBM50462710(CHEMBL4251324)
Affinity DataIC50: >5.00E+3nM. Assay description: Inhibition of AURB (unknown origin)
Ligand InfoPC cidPC sidPDB
In DepthDetails ArticlePubMed
TargetAurora kinase A(Homo sapiens (Human))
Vertex Pharmaceuticals
Curated by ChEMBL
LigandPNGBDBM50462710(CHEMBL4251324)
Affinity DataIC50: >5.00E+3nM. Assay description: Inhibition of AURA (unknown origin)
Ligand InfoPC cidPC sidPDB
In DepthDetails ArticlePubMed
TargetRAC-beta serine/threonine-protein kinase(Homo sapiens (Human))
Vertex Pharmaceuticals
Curated by ChEMBL
LigandPNGBDBM50462710(CHEMBL4251324)
Affinity DataIC50: >5.00E+3nM. Assay description: Inhibition of AKT2 (unknown origin)
Ligand InfoPC cidPC sidPDB
In DepthDetails ArticlePubMed
TargetRAC-alpha serine/threonine-protein kinase(Homo sapiens (Human))
Vertex Pharmaceuticals
Curated by ChEMBL
LigandPNGBDBM50462710(CHEMBL4251324)
Affinity DataIC50: >5.00E+3nM. Assay description: Inhibition of AKT1 (unknown origin)
Ligand InfoPC cidPC sidPDB
In DepthDetails ArticlePubMed
TargetSerine/threonine-protein kinase Sgk1(Homo sapiens (Human))
Vertex Pharmaceuticals
Curated by ChEMBL
LigandPNGBDBM50462710(CHEMBL4251324)
Affinity DataIC50: >1.00E+4nM. Assay description: Inhibition of SGK1 (unknown origin)
Ligand InfoPC cidPC sidPDB
In DepthDetails ArticlePubMed
TargetCyclin-dependent kinase 2(Homo sapiens (Human))
Vertex Pharmaceuticals
Curated by ChEMBL
LigandPNGBDBM50462710(CHEMBL4251324)
Affinity DataIC50: >3.30E+3nM. Assay description: Inhibition of CDK2 (unknown origin)
Ligand InfoPC cidPC sidPDB
In DepthDetails ArticlePubMed
TargetTyrosine-protein kinase ZAP-70(Homo sapiens (Human))
Vertex Pharmaceuticals
Curated by ChEMBL
LigandPNGBDBM50462710(CHEMBL4251324)
Affinity DataIC50: >3.30E+3nM. Assay description: Inhibition of ZAP70 (unknown origin)
Ligand InfoPC cidPC sidPDB
In DepthDetails ArticlePubMed
TargetRho-associated protein kinase 1(Homo sapiens (Human))
Vertex Pharmaceuticals
Curated by ChEMBL
LigandPNGBDBM50462710(CHEMBL4251324)
Affinity DataIC50:  7nM. Assay description: Inhibition of ROCK1 (unknown origin)
Ligand InfoPC cidPC sidPDB
TargetVascular endothelial growth factor receptor 2(Homo sapiens (Human))
Vertex Pharmaceuticals
Curated by ChEMBL
LigandPNGBDBM50462710(CHEMBL4251324)
Affinity DataIC50: >1.00E+4nM. Assay description: Inhibition of KDR (unknown origin)
Ligand InfoPC cidPC sidPDB
In DepthDetails ArticlePubMed
TargetGlycogen synthase kinase-3 beta(Homo sapiens (Human))
Vertex Pharmaceuticals
Curated by ChEMBL
LigandPNGBDBM50462710(CHEMBL4251324)
Affinity DataIC50: >3.30E+3nM. Assay description: Inhibition of GSK3beta (unknown origin)
Ligand InfoPC cidPC sidPDB
In DepthDetails ArticlePubMed
TargetMitogen-activated protein kinase 1(Homo sapiens (Human))
Vertex Pharmaceuticals
Curated by ChEMBL
LigandPNGBDBM50462710(CHEMBL4251324)
Affinity DataIC50: >2.50E+3nM. Assay description: Inhibition of ERK2 (unknown origin)
Ligand InfoPC cidPC sidPDB
In DepthDetails ArticlePubMed
TargetSerine/threonine-protein kinase ATR(Homo sapiens (Human))
Vertex Pharmaceuticals
Curated by ChEMBL
LigandPNGBDBM50462710(CHEMBL4251324)
Affinity DataIC50: >1.00E+4nM. Assay description: Inhibition of ATR (unknown origin)
Ligand InfoPC cidPC sidPDB
In DepthDetails ArticlePubMed
TargetSerine/threonine-protein kinase TBK1(Homo sapiens (Human))
Vertex Pharmaceuticals
Curated by ChEMBL
LigandPNGBDBM50462710(CHEMBL4251324)
Affinity DataIC50: >1.00E+4nM. Assay description: Inhibition of NAK (unknown origin)
Ligand InfoPC cidPC sidPDB
In DepthDetails ArticlePubMed
TargetInhibitor of nuclear factor kappa-B kinase subunit epsilon(Homo sapiens (Human))
Vertex Pharmaceuticals
Curated by ChEMBL
LigandPNGBDBM50462710(CHEMBL4251324)
Affinity DataIC50: >5.00E+3nM. Assay description: Inhibition of IKKi (unknown origin)
Ligand InfoPC cidPC sidPDB
In DepthDetails ArticlePubMed
TargetCitron Rho-interacting kinase(Homo sapiens (Human))
Vertex Pharmaceuticals
Curated by ChEMBL
LigandPNGBDBM50462710(CHEMBL4251324)
Affinity DataIC50: >4.00E+3nM. Assay description: Inhibition of CIT (unknown origin)
Ligand InfoPC cidPC sidPDB
In DepthDetails ArticlePubMed
TargetProtein kinase C theta type(Homo sapiens (Human))
Vertex Pharmaceuticals
Curated by ChEMBL
LigandPNGBDBM50462710(CHEMBL4251324)
Affinity DataIC50: >1.00E+4nM. Assay description: Inhibition of PKCtheta (unknown origin)
Ligand InfoPC cidPC sidPDB
In DepthDetails ArticlePubMed