BDBM50463489 CHEMBL4245089
SMILES Oc1cccc(CC(=O)Nc2nc(cs2)-c2c[nH]c3ncccc23)c1
InChI Key InChIKey=KLJSGAQTZCCEGQ-UHFFFAOYSA-N
Data  1 KI
  Tab Delimited (TSV)   2D SDfile   Computed 3D by Vconf -m prep SDfile
Find this compound or compounds like it in BindingDB:
Activity Spreadsheet -- Enzyme Inhibition Constant Data from BindingDB
Found 1 hit for monomerid = 50463489
TargetRho-associated protein kinase 1(Homo sapiens (Human))
Vertex Pharmaceuticals
Curated by ChEMBL
LigandPNGBDBM50463489(CHEMBL4245089)
Affinity DataKi:  3nM. Assay description: Inhibition of ROCK1 (6 to 553 residues) (unknown origin) using Lys-Lys-Arg-Asn-Arg-Thr-Leu-Ser-Val as substrate in presence of ATP by spectrophotomet...
Ligand InfoPC cidPC sid
In DepthDetails ArticlePubMed