BDBM50465058 CHEMBL4280298::US10550080, Example 39
SMILES CC(C)COc1ncc(cc1Cl)-c1nn(C)c2cc(ccc12)C(=O)NS(C)(=O)=O
InChI Key InChIKey=LAGKKGKWRZUUSJ-UHFFFAOYSA-N
Data  10 IC50
  Tab Delimited (TSV)   2D SDfile   Computed 3D by Vconf -m prep SDfile
Find this compound or compounds like it in BindingDB:
Activity Spreadsheet -- Enzyme Inhibition Constant Data from BindingDB
Found 10 hits for monomerid = 50465058
TargetSodium channel protein type 5 subunit alpha(Homo sapiens (Human))
Temple University School Of Pharmacy
Curated by ChEMBL
LigandPNGBDBM50465058(CHEMBL4280298 | US10550080, Example 39)
Affinity DataIC50:  6.51E+3nM. Assay description: Inhibition of Nav1.5 (unknown origin) expressed in HEK293 cells at -40 mV holding potential measured after 600 secs by patch clamp method
Ligand InfoPC cidPC sid
In DepthDetails ArticlePubMed
TargetSodium channel protein type 9 subunit alpha(Homo sapiens (Human))
Temple University School Of Pharmacy
Curated by ChEMBL
LigandPNGBDBM50465058(CHEMBL4280298 | US10550080, Example 39)
Affinity DataIC50:  67nM. Assay description: Displacement of [3H]-labelled radioligand from human Nav1.7 expressed in HEK293 cells measured after 24 hrs by liquid scintillation counting method
Ligand InfoPC cidPC sid
In DepthDetails ArticlePubMed
TargetSodium channel protein type 9 subunit alpha(Homo sapiens (Human))
Temple University School Of Pharmacy
Curated by ChEMBL
LigandPNGBDBM50465058(CHEMBL4280298 | US10550080, Example 39)
Affinity DataIC50:  66nM. Assay description: Inhibition of Nav1.7 (unknown origin) expressed in HEK293 cells at -60 mV holding potential measured after 600 secs by patch clamp method
Ligand InfoPC cidPC sid
In DepthDetails ArticlePubMed
TargetSodium channel protein type 9 subunit alpha(Homo sapiens (Human))
Temple University School Of Pharmacy
Curated by ChEMBL
LigandPNGBDBM50465058(CHEMBL4280298 | US10550080, Example 39)
Affinity DataIC50:  66nM. Assay description: Ion Works Barracuda population patch clamp (PPC). PPC measurements were performed using an IonWorks Barracuda instrument (Molecular Devices Corporati...
Ligand InfoPC cidPC sid
In DepthDetails US Patent
TargetSodium channel protein type 9 subunit alpha(Mus musculus)
Bristol-Myers Squibb Research And Development
Curated by ChEMBL
LigandPNGBDBM50465058(CHEMBL4280298 | US10550080, Example 39)
Affinity DataIC50:  12nM. Assay description: Inhibition of Nav1.7 in mouse DRG neurons at -70 mV holding potential by patch clamp electrophysiology method
Ligand InfoPC cidPC sid
In DepthDetails ArticlePubMed
TargetSodium channel protein type 5 subunit alpha(Homo sapiens (Human))
Temple University School Of Pharmacy
Curated by ChEMBL
LigandPNGBDBM50465058(CHEMBL4280298 | US10550080, Example 39)
Affinity DataIC50:  6.51E+3nM. Assay description: Ion Works Barracuda population patch clamp (PPC). PPC measurements were performed using an IonWorks Barracuda instrument (Molecular Devices Corporati...
Ligand InfoPC cidPC sid
In DepthDetails US Patent
TargetSodium channel protein type 9 subunit alpha(Homo sapiens (Human))
Temple University School Of Pharmacy
Curated by ChEMBL
LigandPNGBDBM50465058(CHEMBL4280298 | US10550080, Example 39)
Affinity DataIC50:  67nM. Assay description: Inhibition of human Nav1.7 expressed in HEK293 cells after 600 secs at -60 mV holding potential by ion works barracuda population patch clamp method
Ligand InfoPC cidPC sid
In DepthDetails ArticlePubMed
TargetSodium channel protein type 5 subunit alpha(Homo sapiens (Human))
Temple University School Of Pharmacy
Curated by ChEMBL
LigandPNGBDBM50465058(CHEMBL4280298 | US10550080, Example 39)
Affinity DataIC50:  6.50E+3nM. Assay description: Inhibition of human Nav1.5 expressed in HEK293 cells after 600 secs at -50 mV holding potential by ion works barracuda population patch clamp method
Ligand InfoPC cidPC sid
In DepthDetails ArticlePubMed
TargetSodium channel protein type 9 subunit alpha(Homo sapiens (Human))
Temple University School Of Pharmacy
Curated by ChEMBL
LigandPNGBDBM50465058(CHEMBL4280298 | US10550080, Example 39)
Affinity DataIC50:  11nM. Assay description: Inhibition of recombinant human Nav1.7 expressed in HEK293 cells at -70 mV holding potential by patch clamp electrophysiology method
Ligand InfoPC cidPC sid
In DepthDetails ArticlePubMed
TargetSodium channel protein type 9 subunit alpha(Homo sapiens (Human))
Temple University School Of Pharmacy
Curated by ChEMBL
LigandPNGBDBM50465058(CHEMBL4280298 | US10550080, Example 39)
Affinity DataIC50:  67nM. Assay description: hNaV1.7 binding affinities were determined with a filtration binding assay using purified membranes from HEK293 cells stably expressing hNaV1.7. HEK2...
Ligand InfoPC cidPC sid
In DepthDetails US Patent