BDBM50465840 CHEMBL4277254
SMILES Clc1cc(ccc1-c1ccc(cc1)-c1nnn[nH]1)-n1ccnc1
InChI Key InChIKey=OXCABBFFPRAGFC-UHFFFAOYSA-N
Data  1 IC50
  Tab Delimited (TSV)   2D SDfile   Computed 3D by Vconf -m prep SDfile
Find this compound or compounds like it in BindingDB:
Activity Spreadsheet -- Enzyme Inhibition Constant Data from BindingDB
Found 1 hit for monomerid = 50465840
TargetAlcohol dehydrogenase class-3(Homo sapiens (Human))
Glenmark Pharmaceuticals
Curated by ChEMBL
LigandPNGBDBM50465840(CHEMBL4277254)
Affinity DataIC50:  22nM. Assay description: Inhibition of human GSNOR assessed as reduction in NADH consumption after 3 mins by spectrophotometric analysis
Ligand InfoPC cidPC sid
In DepthDetails ArticlePubMed