BDBM50465946 CHEMBL4294397
SMILES Cc1cc(Oc2nccc3occc23)ccc1-c1cccc2nccn12
InChI Key InChIKey=PQMACIUZHAYTRR-UHFFFAOYSA-N
Data  1 KI  5 EC50
  Tab Delimited (TSV)   2D SDfile   Computed 3D by Vconf -m prep SDfile
Find this compound or compounds like it in BindingDB:
Activity Spreadsheet -- Enzyme Inhibition Constant Data from BindingDB
Found 6 hits for monomerid = 50465946
TargetD(1A) dopamine receptor(Homo sapiens (Human))
Pfizer
Curated by ChEMBL
LigandPNGBDBM50465946(CHEMBL4294397)
Affinity DataKi:  38nM. Assay description: Displacement of [3H]-SCH23390 from human dopamine D1 receptor expressed in LTK cell membranes after 30 mins by liquid scintillation counting
Ligand InfoPC cidPC sid
In DepthDetails ArticlePubMed
TargetD(1A) dopamine receptor(Homo sapiens (Human))
Pfizer
Curated by ChEMBL
LigandPNGBDBM50465946(CHEMBL4294397)
Affinity DataEC50:  2.70nM. Assay description: Agonist activity at recombinant human D1 receptor expressed in HEK29T cells assessed as induction of stimulatory G-protein-mediated cAMP accumulation...
Ligand InfoPC cidPC sid
In DepthDetails ArticlePubMed
TargetD(1A) dopamine receptor(Homo sapiens (Human))
Pfizer
Curated by ChEMBL
LigandPNGBDBM50465946(CHEMBL4294397)
Affinity DataEC50:  178nM. Assay description: Agonist activity at recombinant C-terminal RLuc8-fused human D1 receptor expressed in HEK29T cells co-expressing N-terminal Venus-tagged beta-arresti...
Ligand InfoPC cidPC sid
In DepthDetails ArticlePubMed
TargetD(1A) dopamine receptor(Homo sapiens (Human))
Pfizer
Curated by ChEMBL
LigandPNGBDBM50465946(CHEMBL4294397)
Affinity DataEC50:  2.70nM. Assay description: Agonist activity at recombinant human D1 receptor expressed in HEK29T cells assessed as induction of stimulatory G-protein-mediated cAMP accumulation...
Ligand InfoPC cidPC sid
In DepthDetails ArticlePubMed
TargetD(1A) dopamine receptor(Homo sapiens (Human))
Pfizer
Curated by ChEMBL
LigandPNGBDBM50465946(CHEMBL4294397)
Affinity DataEC50:  262nM. Assay description: Agonist activity at human dopamine D1 receptor expressed in HEK293T cells assessed as induction of cAMP levels after 30 mins by HTRF assay
Ligand InfoPC cidPC sid
In DepthDetails ArticlePubMed
TargetD(1A) dopamine receptor(Homo sapiens (Human))
Pfizer
Curated by ChEMBL
LigandPNGBDBM50465946(CHEMBL4294397)
Affinity DataEC50:  180nM. Assay description: Agonist activity at recombinant C-terminal RLuc8-fused human D1 receptor expressed in HEK29T cells co-expressing N-terminal Venus-tagged beta-arresti...
Ligand InfoPC cidPC sid
In DepthDetails ArticlePubMed