BDBM50466018 CHEMBL4283851
SMILES COc1c(Cl)cc(cc1Cl)-c1ccc(s1)C(=O)c1cc(F)c(F)c(O)c1F
InChI Key InChIKey=UTTSXHQNYXLHAR-UHFFFAOYSA-N
Data  3 IC50
  Tab Delimited (TSV)   2D SDfile   Computed 3D by Vconf -m prep SDfile
Find this compound or compounds like it in BindingDB:
Activity Spreadsheet -- Enzyme Inhibition Constant Data from BindingDB
Found 3 hits for monomerid = 50466018
Target17-beta-hydroxysteroid dehydrogenase type 2(Homo sapiens (Human))
Pharmbiotec
Curated by ChEMBL
LigandPNGBDBM50466018(CHEMBL4283851)
Affinity DataIC50:  1.60nM. Assay description: Inhibition of human placental microsomal fraction 17beta-HSD2 using [3H]-E2 as substrate after 20 mins in presence of NAD+ by radio-flow detector bas...
Ligand InfoPC cidPC sid
In DepthDetails ArticlePubMed
TargetEstradiol 17-beta-dehydrogenase 2(Mus musculus)
Pharmbiotec
Curated by ChEMBL
LigandPNGBDBM50466018(CHEMBL4283851)
Affinity DataIC50:  89nM. Assay description: Inhibition of mouse microsomal fraction 17beta-HSD2 using [3H]-E2 as substrate after 20 mins in presence of NAD+ by radio-flow detector based analysi...
Ligand InfoPC cidPC sid
In DepthDetails ArticlePubMed
Target17-beta-hydroxysteroid dehydrogenase type 1(Homo sapiens (Human))
Pharmbiotec
Curated by ChEMBL
LigandPNGBDBM50466018(CHEMBL4283851)
Affinity DataIC50:  0.400nM. Assay description: Inhibition of human placental cytosolic 17beta-HSD1 using [3H]-E1 as substrate after 10 mins in presence of NADPH by radio-flow detector based analys...
Ligand InfoPC cidPC sid
In DepthDetails ArticlePubMed