BDBM50466746 CHEMBL4279691
SMILES CC(C)c1cccc(C(C)C)c1NC(=O)CN1CCCN(CCCSc2nc3ccccc3o2)CC1
InChI Key InChIKey=DVOPSFWSHOUZHK-UHFFFAOYSA-N
Data  1 IC50
  Tab Delimited (TSV)   2D SDfile   Computed 3D by Vconf -m prep SDfile
Find this compound or compounds like it in BindingDB:
Activity Spreadsheet -- Enzyme Inhibition Constant Data from BindingDB
Found 1 hit for monomerid = 50466746
TargetSterol O-acyltransferase 1(Homo sapiens (Human))
Kowa
Curated by ChEMBL
LigandPNGBDBM50466746(CHEMBL4279691)
Affinity DataIC50:  430nM. Assay description: Inhibition of ACAT in human J774A.1 cells assessed as reduction in esterified-cholesterol accumulation after 18 hrs in presence of 25-hydroxycholeste...
Ligand InfoPC cidPC sid
In DepthDetails ArticlePubMed