BDBM50466859 CHEMBL4279616
SMILES COC(=N)c1nc2ccc3ncn(C4CC4)c(=O)c3c2s1
InChI Key InChIKey=YJGOBAYVKWEVDD-UHFFFAOYSA-N
Data  2 IC50
  Tab Delimited (TSV)   2D SDfile   Computed 3D by Vconf -m prep SDfile
Find this compound or compounds like it in BindingDB:
Activity Spreadsheet -- Enzyme Inhibition Constant Data from BindingDB
Found 2 hits for monomerid = 50466859
TargetDual specificity protein kinase CLK1(Homo sapiens (Human))
Seoul National University
Curated by ChEMBL
LigandPNGBDBM50466859(CHEMBL4279616)
Affinity DataIC50:  31nM. Assay description: Inhibition of human recombinant GST-fused CLK1 expressed in Escherichia coli using GRSRSRSRSRSR as substrate in presence of [gamma-33P]ATP after 30 m...
Ligand InfoPC cidPC sid
In DepthDetails ArticlePubMed
TargetDual specificity tyrosine-phosphorylation-regulated kinase 1A(RAT)
Seoul National University
Curated by ChEMBL
LigandPNGBDBM50466859(CHEMBL4279616)
Affinity DataIC50:  91nM. Assay description: Inhibition of rat recombinant GST-fused DYRK1A expressed in Escherichia coli in presence of [gamma-33P]ATP after 30 mins by scintillation counting an...
Ligand InfoPC cidPC sid
In DepthDetails ArticlePubMed