BDBM50466893 CHEMBL4291727
SMILES Cn1cc(C2CCN(CC2)C(=O)C2CCCC2)c2cc(NC(=O)c3cccc(c3)C#N)ccc12
InChI Key InChIKey=RBLNFIJEEWFSTH-UHFFFAOYSA-N
Data  1 KI  7 IC50
  Tab Delimited (TSV)   2D SDfile   Computed 3D by Vconf -m prep SDfile
Find this compound or compounds like it in BindingDB:
Activity Spreadsheet -- Enzyme Inhibition Constant Data from BindingDB
Found 8 hits for monomerid = 50466893
TargetNuclear receptor ROR-gamma(Homo sapiens (Human))
Karo Pharma
Curated by ChEMBL
LigandPNGBDBM50466893(CHEMBL4291727)
Affinity DataKi:  50nM. Assay description: Displacement of [3H]-25-hydroxycholesterol from human N-terminal 6His-tagged-RORC2 LBD (259 to 483 residues) expressed in Escherichia coli (DE3) cell...
Ligand InfoPC cidPC sid
In DepthDetails ArticlePubMed
TargetNuclear receptor ROR-gamma(Homo sapiens (Human))
Karo Pharma
Curated by ChEMBL
LigandPNGBDBM50466893(CHEMBL4291727)
Affinity DataIC50:  5.5nM. Assay description: Inverse agonist activity at human N-terminal 6His-tagged-RORC2 LBD (259 to 483 residues) expressed in Escherichia coli (DE3) cells assessed as inhibi...
Ligand InfoPC cidPC sid
In DepthDetails ArticlePubMed
TargetNuclear receptor ROR-gamma(Homo sapiens (Human))
Karo Pharma
Curated by ChEMBL
LigandPNGBDBM50466893(CHEMBL4291727)
Affinity DataIC50:  170nM. Assay description: Inverse agonist activity at GAL4-fused RORC2 LBD (unknown origin) expressed in mouse neuro2A cells assessed as inhibition of transcriptional activity...
Ligand InfoPC cidPC sid
In DepthDetails ArticlePubMed
TargetNuclear receptor ROR-beta(Homo sapiens (Human))
Karo Pharma
Curated by ChEMBL
LigandPNGBDBM50466893(CHEMBL4291727)
Affinity DataIC50: >3.00E+4nM. Assay description: Inverse agonist activity at GAL4-fused RORB LBD (unknown origin) expressed in mouse neuro2A cells assessed as inhibition of transcriptional activity ...
Ligand InfoPC cidPC sid
In DepthDetails ArticlePubMed
TargetNuclear receptor ROR-alpha(Homo sapiens (Human))
Karo Pharma
Curated by ChEMBL
LigandPNGBDBM50466893(CHEMBL4291727)
Affinity DataIC50: >3.00E+4nM. Assay description: Inverse agonist activity at GAL4-fused RORA LBD (unknown origin) expressed in mouse neuro2A cells assessed as inhibition of transcriptional activity ...
Ligand InfoPC cidPC sid
In DepthDetails ArticlePubMed
TargetNuclear receptor ROR-alpha(Homo sapiens (Human))
Karo Pharma
Curated by ChEMBL
LigandPNGBDBM50466893(CHEMBL4291727)
Affinity DataIC50: >3.00E+4nM. Assay description: Inverse agonist activity at RORA (unknown origin) assessed as inhibition of biotinylated co-activator SRC1-2 peptide recruitment after 3 hrs by TR-FR...
Ligand InfoPC cidPC sid
In DepthDetails ArticlePubMed
TargetNuclear receptor ROR-beta(Homo sapiens (Human))
Karo Pharma
Curated by ChEMBL
LigandPNGBDBM50466893(CHEMBL4291727)
Affinity DataIC50: >3.00E+4nM. Assay description: Inverse agonist activity at RORB (unknown origin) assessed as inhibition of biotinylated co-activator SRC1-2 peptide recruitment after 3 hrs by TR-FR...
Ligand InfoPC cidPC sid
In DepthDetails ArticlePubMed
TargetNuclear receptor ROR-gamma(Homo sapiens (Human))
Karo Pharma
Curated by ChEMBL
LigandPNGBDBM50466893(CHEMBL4291727)
Affinity DataIC50:  67nM. Assay description: Inverse agonist activity at RORC2 in human Th17 cells assessed as inhibition of IL17A production after 6 days by sandwich ELISA
Ligand InfoPC cidPC sid
In DepthDetails ArticlePubMed