BDBM50469784 CHEMBL14975
SMILES COc1ccc2[nH]c(c(CCNC(=O)C3CC3)c2c1)-c1ccccc1
InChI Key InChIKey=HVOBQOQYMLXCPR-UHFFFAOYSA-N
Data  2 KI
  Tab Delimited (TSV)   2D SDfile   Computed 3D by Vconf -m prep SDfile
Find this compound or compounds like it in BindingDB:
Activity Spreadsheet -- Enzyme Inhibition Constant Data from BindingDB
Found 2 hits for monomerid = 50469784
TargetMelatonin receptor type 1A/1B(Homo sapiens (Human))
University Of Urbino
Curated by ChEMBL
LigandPNGBDBM50469784(CHEMBL14975)
Affinity DataKi:  0.240nM. Assay description: Inhibition of 2-[125I]iodomelatonin binding to melatonin receptor in quail brain as 1/Ka
Ligand InfoPC cidPC sid
In DepthDetails ArticlePubMed
TargetMelatonin receptor type 1C(Gallus gallus)
University College London
Curated by ChEMBL
LigandPNGBDBM50469784(CHEMBL14975)
Affinity DataKi:  0.305nM. Assay description: Binding affinity in chicken brain membranes by using [2-125I]melatonin in a competition radioligand binding assay
Ligand InfoPC cidPC sid
In DepthDetails ArticlePubMed