BDBM50471487 CHEMBL436075
SMILES [H][C@@]12CN(C[C@H]1c1nsnc1SCCCC(F)(F)F)CCC2
InChI Key InChIKey=QROOTTZWVVRLNV-NXEZZACHSA-N
Data  1 KI
  Tab Delimited (TSV)   2D SDfile   Computed 3D by Vconf -m prep SDfile
Find this compound or compounds like it in BindingDB:
Activity Spreadsheet -- Enzyme Inhibition Constant Data from BindingDB
Found 1 hit for monomerid = 50471487
TargetMuscarinic acetylcholine receptor M1/M2/M3/M4/M5(RAT)
Lilly Research Laboratories
Curated by ChEMBL
LigandPNGBDBM50471487(CHEMBL436075)
Affinity DataKi:  0.330nM. Assay description: Binding affinity against Muscarinic acetylcholine receptors using [3H]oxotremorine-M as radioligand in rat cortex
Ligand InfoPC cidPC sid
In DepthDetails ArticlePubMed