BDBM50472458 CHEMBL145148
SMILES [H][C@@](Cc1cccc(c1)C(N)=N)(NS(=O)(=O)c1ccc2ccccc2c1)C(=O)OCc1ccccc1
InChI Key InChIKey=ZOOBSCBTPJHQGN-VWLOTQADSA-N
Data  3 KI
  Tab Delimited (TSV)   2D SDfile   Computed 3D by Vconf -m prep SDfile
Find this compound or compounds like it in BindingDB:
Activity Spreadsheet -- Enzyme Inhibition Constant Data from BindingDB
Found 3 hits for monomerid = 50472458
TargetProthrombin(Bos taurus (Bovine))
University Of Marburg
Curated by ChEMBL
LigandPNGBDBM50472458(CHEMBL145148)
Affinity DataKi:  42nM. Assay description: Binding affinity towards thrombin
Ligand InfoPC cidPC sid
In DepthDetails ArticlePubMed
TargetSerine protease 1(Bos taurus (bovine))
University Of Marburg
Curated by ChEMBL
LigandPNGBDBM50472458(CHEMBL145148)
Affinity DataKi:  519nM. Assay description: Binding affinity towards trypsin
Ligand InfoPC cidPC sid
In DepthDetails ArticlePubMed
TargetCoagulation factor X(Homo sapiens (Human))
University Of Marburg
Curated by ChEMBL
LigandPNGBDBM50472458(CHEMBL145148)
Affinity DataKi:  2.19E+3nM. Assay description: Binding affinity towards Coagulation factor Xa
Ligand InfoPC cidPC sid
In DepthDetails ArticlePubMed