BDBM50472483 CHEMBL145108
SMILES [H][C@@](Cc1cccc(c1)C(N)=N)(NS(=O)(=O)c1ccc2ccccc2c1)C(=O)N1CCC(CC1)C=O
InChI Key InChIKey=VVZXKVGDWVTRBJ-DEOSSOPVSA-N
Data  3 KI
  Tab Delimited (TSV)   2D SDfile   Computed 3D by Vconf -m prep SDfile
Find this compound or compounds like it in BindingDB:
Activity Spreadsheet -- Enzyme Inhibition Constant Data from BindingDB
Found 3 hits for monomerid = 50472483
TargetProthrombin(Bos taurus (Bovine))
University Of Marburg
Curated by ChEMBL
LigandPNGBDBM50472483(CHEMBL145108)
Affinity DataKi:  37nM. Assay description: Binding affinity towards thrombin
Ligand InfoPC cidPC sid
In DepthDetails ArticlePubMed
TargetSerine protease 1(Bos taurus (bovine))
University Of Marburg
Curated by ChEMBL
LigandPNGBDBM50472483(CHEMBL145108)
Affinity DataKi:  219nM. Assay description: Binding affinity towards trypsin
Ligand InfoPC cidPC sid
In DepthDetails ArticlePubMed
TargetCoagulation factor X(Homo sapiens (Human))
University Of Marburg
Curated by ChEMBL
LigandPNGBDBM50472483(CHEMBL145108)
Affinity DataKi:  1.90E+4nM. Assay description: Binding affinity towards Coagulation factor Xa
Ligand InfoPC cidPC sid
In DepthDetails ArticlePubMed