BDBM50478336 Imidobisphosphate::Imidodiphosphate
SMILES OP(O)(=O)NP(O)(O)=O
InChI Key InChIKey=GNGSOPFGGKKDQP-UHFFFAOYSA-N
Data  2 KI
PDB links: 18 PDB IDs match this monomer.
  Tab Delimited (TSV)   2D SDfile   Computed 3D by Vconf -m prep SDfile
Find this compound or compounds like it in BindingDB:
Activity Spreadsheet -- Enzyme Inhibition Constant Data from BindingDB
Found 2 hits for monomerid = 50478336
TargetType IV secretion-like conjugative transfer relaxase protein TraI(Escherichia coli (strain SMS-3-5 / SECEC))
University Of North Carolina
Curated by ChEMBL
LigandPNGBDBM50478336(Imidobisphosphate | Imidodiphosphate)
Affinity DataKi:  2nM. Assay description: Inhibition of Escherichia coli F plasmid TraI relaxase Y16F mutant assessed as oriT ssDNA cleavage by competitive inhibition assay
In DepthDetails ArticlePubMed
TargetType IV secretion-like conjugative transfer relaxase protein TraI(Escherichia coli (strain SMS-3-5 / SECEC))
University Of North Carolina
Curated by ChEMBL
LigandPNGBDBM50478336(Imidobisphosphate | Imidodiphosphate)
Affinity DataKi:  2.70nM. Assay description: Inhibition of Escherichia coli F plasmid TraI relaxase Y16F mutant assessed as oriT ssDNA cleavage by uncompetitive inhibition assay
In DepthDetails ArticlePubMed