BDBM50478540 Diplyne C sulfate
SMILES OC(COS(O)(=O)=O)C#CC#CCCCCCCCC\C=C\Br
InChI Key InChIKey=HZARHHWAEHHVPW-WYMLVPIESA-N
Data  1 IC50
  Tab Delimited (TSV)   2D SDfile   Computed 3D by Vconf -m prep SDfile
Find this compound or compounds like it in BindingDB:
Activity Spreadsheet -- Enzyme Inhibition Constant Data from BindingDB
Found 1 hit for monomerid = 50478540
TargetIntegrase(Human immunodeficiency virus 1)
University Of California At San Diego
Curated by ChEMBL
LigandPNGBDBM50478540(Diplyne C sulfate)
Affinity DataIC50:  7.36E+4nM. Assay description: Inhibition of HIV1 recombinant integrase
Ligand InfoKEGGPC cidPC sid
In DepthDetails ArticlePubMed