BDBM50480490 CHEMBL537916::acs.jmedchem.1c00409_ST.792
SMILES CCCN(CCC)C(=O)CC[C@H](NC(=O)[C@H](CC(C)C)NC(=O)[C@@H](NC(=O)[C@H](C)NC(=O)OCc1ccccc1)C(C)C)C(=O)C(F)(F)F
InChI Key InChIKey=RNZGLPULHIKMGO-XCDZTUSXSA-N
Data  2 KI
  Tab Delimited (TSV)   2D SDfile   Computed 3D by Vconf -m prep SDfile
Find this compound or compounds like it in BindingDB:
Activity Spreadsheet -- Enzyme Inhibition Constant Data from BindingDB
Found 2 hits for monomerid = 50480490
TargetReplicase polyprotein 1ab(Human SARS coronavirus (SARS-CoV) (Severe acute re...)
Michigan State University
LigandPNGBDBM50480490(CHEMBL537916 | acs.jmedchem.1c00409_ST.792)
Affinity DataKi:  2.97E+5nM. Assay description: This is a review article. Please point to the original journal.
Ligand InfoPC cidPC sid
In DepthDetails ArticlePubMed
TargetReplicase polyprotein 1ab(Human SARS coronavirus (SARS-CoV) (Severe acute re...)
Michigan State University
LigandPNGBDBM50480490(CHEMBL537916 | acs.jmedchem.1c00409_ST.792)
Affinity DataKi:  2.97E+5nM. Assay description: Inhibition of SARS coronavirus 3CL protease pretreated for 10 mins before substrate addition
Ligand InfoPC cidPC sid
In DepthDetails ArticlePubMed