BDBM50481500 CHEMBL590788
SMILES [O-][N+](=O)c1ccc(Cn2c(\C=C3\C(=O)NC(=S)N(CC=C)C3=O)cc3ccccc23)cc1
InChI Key InChIKey=RXZXFUMAZUBRES-UYRXBGFRSA-N
Data  1 IC50
  Tab Delimited (TSV)   2D SDfile   Computed 3D by Vconf -m prep SDfile
Find this compound or compounds like it in BindingDB:
Activity Spreadsheet -- Enzyme Inhibition Constant Data from BindingDB
Found 1 hit for monomerid = 50481500
TargetLL-diaminopimelate aminotransferase, chloroplastic(Arabidopsis thaliana)
University Of Alberta
Curated by ChEMBL
LigandPNGBDBM50481500(CHEMBL590788)
Affinity DataIC50:  6.90E+4nM. Assay description: Inhibition of Arabidopsis thaliana LL-DAP-AT expressed in Escherichia coli by aminobenzaldehyde-based assay
Ligand InfoPC cidPC sid
In DepthDetails ArticlePubMed