BDBM50483061 CHEMBL1277047
SMILES OC(=O)c1ccc(\C=C2/C(=O)N(N=C2c2ccccc2)c2ccc(OC(F)(F)F)cc2)cc1
InChI Key InChIKey=CODVAOCBWRTXOE-ZHZULCJRSA-N
Data  2 IC50
  Tab Delimited (TSV)   2D SDfile   Computed 3D by Vconf -m prep SDfile
Find this compound or compounds like it in BindingDB:
Activity Spreadsheet -- Enzyme Inhibition Constant Data from BindingDB
Found 2 hits for monomerid = 50483061
TargetGenome polyprotein(Coxsackievirus B3 (strain Nancy))
Academia Sinica
Curated by ChEMBL
LigandPNGBDBM50483061(CHEMBL1277047)
Affinity DataIC50:  9.88E+4nM. Assay description: Inhibition of coxsackievirus B3 3C protease by fluorescence plate reader analysis
Ligand InfoPC cidPC sid
In DepthDetails ArticlePubMed
TargetReplicase polyprotein 1ab(Human SARS coronavirus (SARS-CoV) (Severe acute re...)
Academia Sinica
Curated by ChEMBL
LigandPNGBDBM50483061(CHEMBL1277047)
Affinity DataIC50:  4.20E+4nM. Assay description: Inhibition of SARS coronavirus 3C-like protease by fluorescence plate reader analysis
Ligand InfoPC cidPC sid
In DepthDetails ArticlePubMed