BDBM50483375 CHEMBL1236446
SMILES CCCCCCCCCCCCCC(=O)O[C@@H]1[C@@H](CC(=O)NO)CO[C@H](CO)[C@H]1O
InChI Key InChIKey=INAPDIIIYSWKOC-XHIHJMKYSA-N
Data  2 KI
PDB links: 2 PDB IDs match this monomer.
  Tab Delimited (TSV)   2D SDfile   Computed 3D by Vconf -m prep SDfile
Find this compound or compounds like it in BindingDB:
Activity Spreadsheet -- Enzyme Inhibition Constant Data from BindingDB
Found 2 hits for monomerid = 50483375
TargetUDP-3-O-acyl-N-acetylglucosamine deacetylase(Escherichia coli)
Pfizer
Curated by ChEMBL
LigandPNGBDBM50483375(CHEMBL1236446)
Affinity DataKi:  650nM. Assay description: Inhibition of Escherichia coli LpxC
Ligand InfoPC cidPC sidPDB
In DepthDetails ArticlePubMed
TargetUDP-3-O-acyl-N-acetylglucosamine deacetylase(Escherichia coli)
Pfizer
Curated by ChEMBL
LigandPNGBDBM50483375(CHEMBL1236446)
Affinity DataKi:  650nM. Assay description: Inhibition of Escherichia coli LpxC
Ligand InfoPC cidPC sidPDB
In DepthDetails ArticlePubMed