BDBM50484482 CHEMBL1929017::acs.jmedchem.1c00409_ST.380::med.21724, Compound 45
SMILES CC(C)C[C@H](NC(=O)[C@@H](NC(=O)[C@H](C)NC(=O)[C@H](CO)NC(C)=O)C(C)C)C(=O)N[C@@H](Cc1c[nH]cn1)C=O
InChI Key InChIKey=AEYIBAPLFDNVGD-JMMIECQRSA-N
Data  5 IC50
  Tab Delimited (TSV)   2D SDfile   Computed 3D by Vconf -m prep SDfile
Find this compound or compounds like it in BindingDB:
Activity Spreadsheet -- Enzyme Inhibition Constant Data from BindingDB
Found 5 hits for monomerid = 50484482
TargetReplicase polyprotein 1ab(Human SARS coronavirus (SARS-CoV) (Severe acute re...)
University Of Bonn
LigandPNGBDBM50484482(CHEMBL1929017 | acs.jmedchem.1c00409_ST.380 | med....)
Affinity DataIC50:  98nM. Assay description: This is a review article.
Ligand InfoPC cidPC sid
In DepthDetails ArticlePubMed
TargetReplicase polyprotein 1ab(Human SARS coronavirus (SARS-CoV) (Severe acute re...)
University Of Bonn
LigandPNGBDBM50484482(CHEMBL1929017 | acs.jmedchem.1c00409_ST.380 | med....)
Affinity DataIC50:  5.70E+3nM. Assay description: This is a review article.
Ligand InfoPC cidPC sid
In DepthDetails ArticlePubMed
TargetReplicase polyprotein 1ab(Human SARS coronavirus (SARS-CoV) (Severe acute re...)
University Of Bonn
LigandPNGBDBM50484482(CHEMBL1929017 | acs.jmedchem.1c00409_ST.380 | med....)
Affinity DataIC50:  5.70E+3nM. Assay description: This is a review article. Please point to the original journal.
Ligand InfoPC cidPC sid
In DepthDetails ArticlePubMed
TargetChymotrypsin-like protease CTRL-1(Homo sapiens (Human))
Kyoto Pharmaceutical University
Curated by ChEMBL
LigandPNGBDBM50484482(CHEMBL1929017 | acs.jmedchem.1c00409_ST.380 | med....)
Affinity DataIC50:  5.70E+3nM. Assay description: Inhibition of chymotrypsin-like protease R188I mutant using peptide substrate SO1 preincubated for 20 mins before substrate addition and measured aft...
Ligand InfoPC cidPC sid
In DepthDetails ArticlePubMed
TargetChymotrypsin-like protease CTRL-1(Homo sapiens (Human))
Kyoto Pharmaceutical University
Curated by ChEMBL
LigandPNGBDBM50484482(CHEMBL1929017 | acs.jmedchem.1c00409_ST.380 | med....)
Affinity DataIC50:  5.70E+3nM. Assay description: Inhibition of chymotrypsin-like protease R188I mutant using peptide substrate SO1 measured after 60 mins by HPLC analysis
Ligand InfoPC cidPC sid
In DepthDetails ArticlePubMed