BDBM50487157 CHEMBL2251817
SMILES OP(O)(=O)OP(O)(=O)OCc1cccnc1
InChI Key InChIKey=ZGCXLEIPHNIRMO-UHFFFAOYSA-N
Data  1 IC50
PDB links: 1 PDB ID matches this monomer.
  Tab Delimited (TSV)   2D SDfile   Computed 3D by Vconf -m prep SDfile
Find this compound or compounds like it in BindingDB:
Activity Spreadsheet -- Enzyme Inhibition Constant Data from BindingDB
Found 1 hit for monomerid = 50487157
Target4-hydroxy-3-methylbut-2-enyl diphosphate reductase(Aquifex aeolicus)
University Of Illinois At Urbana-Champaign
Curated by ChEMBL
LigandPNGBDBM50487157(CHEMBL2251817)
Affinity DataIC50:  3.80E+4nM. Assay description: Inhibition of Aquifex aeolicus IspH expressed in Escherichia coli BL21 (DE3) using HMBPP substrate
In DepthDetails ArticlePubMed