BDBM50487980 DESMETHYLTHIAMETHOXAM
SMILES [O-][N+](=O)\N=C1/NCOCN1Cc1cnc(Cl)s1
InChI Key InChIKey=LOXCNVOJGRNBFX-UHFFFAOYSA-N
Data  3 IC50
  Tab Delimited (TSV)   2D SDfile   Computed 3D by Vconf -m prep SDfile
Find this compound or compounds like it in BindingDB:
Activity Spreadsheet -- Enzyme Inhibition Constant Data from BindingDB
Found 3 hits for monomerid = 50487980
TargetNicotinic acetylcholine receptor alpha 5 subunit(Musca domestica)
University Of California
Curated by ChEMBL
LigandPNGBDBM50487980(DESMETHYLTHIAMETHOXAM)
Affinity DataIC50:  16nM. Assay description: Displacement of [3H]IMI from nicotinic acetylcholine receptor in Musca domestica (house fly) head membrane after 90 min by filter binding assay
Ligand InfoPC cidPC sid
In DepthDetails ArticlePubMed
TargetAcetylcholine receptor subunit beta-like 2(Drosophila melanogaster)
University Of California
Curated by ChEMBL
LigandPNGBDBM50487980(DESMETHYLTHIAMETHOXAM)
Affinity DataIC50:  11nM. Assay description: Displacement of [3H]IMI from nicotinic acetylcholine receptor in Aphis craccivora (cowpea aphid) whole body membrane after 90 min by filter binding a...
Ligand InfoPC cidPC sid
In DepthDetails ArticlePubMed
TargetAcetylcholine receptor subunit beta-like 2(Drosophila melanogaster)
University Of California
Curated by ChEMBL
LigandPNGBDBM50487980(DESMETHYLTHIAMETHOXAM)
Affinity DataIC50:  20nM. Assay description: Displacement of [3H]IMI from nicotinic acetylcholine receptor in Drosophila melanogaster head membrane after 90 min by filter binding assay
Ligand InfoPC cidPC sid
In DepthDetails ArticlePubMed