BDBM50489039 CHEMBL2299199
SMILES CC(C)(C)c1cc2ccccc2c(=S)o1
InChI Key InChIKey=ATQLLRZTUGXNHG-UHFFFAOYSA-N
Data  1 IC50
  Tab Delimited (TSV)   2D SDfile   Computed 3D by Vconf -m prep SDfile
Find this compound or compounds like it in BindingDB:
Activity Spreadsheet -- Enzyme Inhibition Constant Data from BindingDB
Found 1 hit for monomerid = 50489039
TargetLactoperoxidase(Bos taurus (Bovine))TBA
LigandPNGBDBM50489039(CHEMBL2299199)
Affinity DataIC50:  2.19E+4nM. Assay description: Inhibition of Bos taurus (bovine) milk lactoperoxidase-catalyzed iodination of L-tyrosine substrate by reverse phase HPLC analysis
Ligand InfoPC cidPC sid
In DepthDetails Article